{"text_format":"1","workbook":"xlsx","n_sheets":8,"sheets":["Titlepage","Instructions","Risk Register","TRR calculations","Consequence  table","likelihood table","controls and risk matrix","confidence table"],"not_rendered":{"charts":0,"images":2,"macros":1,"external_links":2,"defined_names":37,"comments":1,"pivot_tables":0},"unopened":[],"bounds":{"document_bytes":16777216,"sheet_cells":100000,"rows_first":2000,"rows_last":500,"rows_between":2000,"halvings":0,"cell_chars":16384,"cell_head_chars":4096},"cells_cut":0,"cells_raw":0,"read":"whole","date_system":"1900"}

{"sheet":"Titlepage","index":0,"n_rows":34,"n_cols":2,"rows_kept":34,"cut":false,"hidden":false,"merged":[]}
[]
[]
[null,"Tasmanian Emergency Risk Register Tool (v1.0)"]
[null,"TERR TOOL"]
[]
[]
[]
[]
[]
[]
[]
[]
[]
[]
[null,"Tasmania State Emergency Management Committee"]
[]
[]
[]
[null,"Tasmanian Emergency Risk  Register Tool  Version 1.1 - Excel 2007 version"]
[null,"2017-08-08"]
[]
[]
[]
[null,"Excel may be unstable when using macro enabled worksheets, depending on which version of Excel and/or operating system is used. Users are encouraged to “Save-as” with new names on a regular basis to ensure data is protected e.g. save as version 1, version 2 etc."]
[]
[]
[null,"Please see the 'Instructions' sheet for a guide of how to use this spreadsheet."]
[]
[]
[null,"This version of the Tool is designed for Excel 2007 or newer. "]
{"$rows_left_out":5}
{"sheet":"Instructions","index":1,"n_rows":36,"n_cols":3,"rows_kept":36,"cut":false,"hidden":false,"merged":[]}
[]
[]
[]
[null,"Instructions for using the Tasmania Emergency Risk Register Tool"]
[null,"This version is designed for Excel 2007 or newer"]
[]
[]
[]
[]
[null,"The page numbers below refer to pages from the Tasmania  Emergency Risk Assessment Guidelines where you can find more information."]
[]
[]
[]
[null,"Risk Register sheet"]
[null,"This is the main Risk Register for your risk assessment."]
[null,"Enter the following information into this sheet moving from left to right."]
[null,null,"TERA Guideline page number"]
[null,"• Enter a risk statement"]
[null,"• Select a hazard"]
[null,"• Select the hazard event liklihood (AEP)"]
[null,"• Select a impact area"]
[null,"• Select any existing prevention, preparedness, recovery or response controls strength level"]
[null,"• Select any existing prevention, preparedness, recovery or response controls expediency level"]
[null,"The register will automatically generate a control effectiveness measure"]
[null,"• Select the maximum consequence for the risk statement"]
[null,"• Select a confidence level based on how confident you are on your estimate of consequence and probability"]
[null,"The register will automatically generate a liklihood mesaure for the combined event and consequence occurrence"]
[null,"The register will automatically generate a risk level"]
[null,"The register will automatically generate a priority for the risk"]
[null,"• Select a risk treatment option"]
{"$rows_left_out":7}
{"sheet":"Risk Register","index":2,"n_rows":508,"n_cols":21,"rows_kept":508,"cut":false,"hidden":false,"merged":[]}
[null,"Risk Statement part A  (Hazard)","Risk Statement part B  (Consequence)","Select Hazard 1","Select Hazard 2","Enter event liklihood (AEP)","Select Impact Area","Select Maximum Consequence","Controls strength\n\nPrevention/Preparedness\nRecovery/Response","Controls expediency\n\n1 Prevention/Preparedness\n2 Recovery/Response","Auto generated control effectiveness ","Select Confidence level","Auto Generated Combined Likelihood Level","Auto Generated Risk Level","Auto Generated Priority Level","Treatment Options","Risk Treatment Strategies","Risk treatment actions","Risk ranking","Municipalities","Region"]
[null,"EXAMPLE\nThere is the potential that a slow moving severe storm will impact north west Tasmania activating landslip in band 3 landslip areas","EXAMPLE\nCausing social disruption to small communities","Landslip, Landslide","Landslip, Landslide","Unlikely ","Social Setting","Catastrophic","Very low","Very low",{"$f":"INDEX('TRR calculations'!$AE$4:$AE$19,MATCH(1,('TRR calculations'!$AC$4:$AC$19=I2)*('TRR calculations'!$AD$4:$AD$19=J2),0))","v":"Very low"},"Low",{"$f":"INDEX('TRR calculations'!$Z$4:$Z$27,MATCH(1,('TRR calculations'!$X$4:$X$27=F2)*('TRR calculations'!$Y$4:$Y$27=K2),0))","v":"Unlikely "},{"$f":"INDEX('TRR calculations'!$V$4:$V$33,MATCH(1,('TRR calculations'!$T$4:$T$33=H2)*( 'TRR calculations'!$U$4:$U$33=M2),0))","v":"Extreme"},{"$f":"INDEX('TRR calculations'!$F$4:$F$153,MATCH(1,('TRR calculations'!$D$4:$D$153=H2)*('TRR calculations'!$C$4:$C$153=L2)*('TRR calculations'!$E$4:$E$153=M2),0))","v":1},"Monitor and review",null,null,null,"Clarence\nHobart\nGlenorchy"]
[]
[]
[]
[]
[]
[]
[]
[]
[]
[]
[]
[]
[]
[]
[]
[]
[]
[]
[]
[]
[]
[]
[]
[]
[]
[]
[]
[]
{"$rows_left_out":479}
{"sheet":"TRR calculations","index":3,"n_rows":153,"n_cols":36,"rows_kept":153,"cut":false,"hidden":false,"merged":[[1,2,1,5],[1,7,1,12],[1,19,1,21],[1,23,1,25],[1,28,1,30]]}
[]
[null,null,"Priority level calculation",null,null,null,null,"Drop down lists",null,null,null,null,null,null,null,null,null,null,null,"Risk level matrix",null,null,null,"Consequence probalility",null,null,null,null,"Control effectiveness",null,null,null,null,"AEP List",null,"Risk treatment strategy"]
[null,null,"Confidence","Consequence","Likelihood","Rating",null,"Hazard List","Impact area",null,"Consequence list",null,"Confidence list","Treatment required",null,"Auto likelihood level list",null,"Control strength list","Control expediency list","Consequence","Likelihood","Risk",null,"AEP","Control ","Modified Likilihood",null,null,"Strength","Expediency","Modified Liklihood"]
[null,null,"Highest","Insignificant","Almost Certain ",4,null,null,null,null,null,null,null,null,null,null,null,null,null,"Insignificant","Almost Certain ","Medium",null,"Almost Certain ","very low","Almost Certain ",null,null,"Very low","Very low","Very low",null,null,"Almost Certain ",null,"Avoiding the risk"]
[null,null,"Highest","Insignificant","Likely ",5,null,"Biosecurity","Economy",null,"Insignificant",null,"Highest","Treatment",null,"Almost Certain ",null,"Very low","Very low","Insignificant","Likely ","Low",null,"Almost Certain ","Low","Almost Certain ",null,null,"Very low","Low ","Very low",null,null,"Likely ",null,"Removing the risk source"]
[null,null,"Highest","Insignificant","Unlikely ",5,null,"Coastal Erosion","Environment",null,"Minor",null,"High","Further analysis",null,"Likely ",null,"Low ","Low ","Insignificant","Unlikely ","Low",null,"Almost Certain ","medium","Likely ",null,null,"Very low","Medium","Low",null,null,"Unlikely ",null,"Change the consequence of the risk"]
[null,null,"Highest","Insignificant","Rare ",5,null,"Coastal Inundation - storm tide","People",null,"Moderate",null,"Moderate","Monitor and review",null,"Unlikely ",null,"Medium","Medium","Insignificant","Rare ","Very Low",null,"Almost Certain ","high","Likely ",null,null,"Very low","High","Low",null,null,"Rare ",null,"Change the likelihood of the risk"]
[null,null,"Highest","Insignificant","Very Rare ",5,null,"Earthquake","Public Administration",null,"Major",null,"Low",null,null,"Rare ",null,"High","High","Insignificant","Very Rare ","Very Low",null,"Likely ","very low","Likely ",null,null,"Low ","Very low","Very low",null,null,"Very Rare ",null,"Retain the risk by informed decision"]
[null,null,"Highest","Insignificant","Extremely Rare",5,null,"Energy Supply Emergency","Social Setting",null,"Catastrophic",null,"Lowest",null,null,"Very Rare ",null,null,null,"Insignificant","Extremely Rare","Very Low",null,"Likely ","Low","Likely ",null,null,"Low ","Low ","Low",null,null,"Extremely Rare",null,"Sharing the risk"]
[null,null,"Highest","Minor","Almost Certain ",4,null,"Fire-bush",null,null,null,null,null,null,null,"Extremely Rare",null,null,null,"Minor","Almost Certain ","Medium",null,"Likely ","medium","Unlikely ",null,null,"Low ","Medium","Medium"]
[null,null,"Highest","Minor","Likely ",4,null,"Fire - structure",null,null,null,null,null,null,null,null,null,null,null,"Minor","Likely ","Medium",null,"Likely ","high","Unlikely ",null,null,"Low ","High","Medium"]
[null,null,"Highest","Minor","Unlikely ",5,null,"Flood - dam emergency",null,null,null,null,null,null,null,null,null,null,null,"Minor","Unlikely ","Low",null,"Unlikely ","very low","Unlikely ",null,null,"Medium","Very low","Low"]
[null,null,"Highest","Minor","Rare ",5,null,"Flood - flash",null,null,null,null,null,null,null,null,null,null,null,"Minor","Rare ","Low",null,"Unlikely ","Low","Unlikely ",null,null,"Medium","Low ","Medium"]
[null,null,"Highest","Minor","Very Rare ",5,null,"Flood - river",null,null,null,null,null,null,null,null,null,null,null,"Minor","Very Rare ","Very Low",null,"Unlikely ","medium","Unlikely ",null,null,"Medium","Medium","Medium"]
[null,null,"Highest","Minor","Extremely Rare",5,null,"Food Contamination",null,null,null,null,null,null,null,null,null,null,null,"Minor","Extremely Rare","Very Low",null,"Unlikely ","high","Rare ",null,null,"Medium","High","Medium"]
[null,null,"Highest","Moderate","Almost Certain ",3,null,"Hazardous Material",null,null,null,null,null,null,null,null,null,null,null,"Moderate","Almost Certain ","High",null,"Rare ","very low","Rare ",null,null,"High","Very low","Low"]
[null,null,"Highest","Moderate","Likely ",4,null,"Hazardous Material - radiological accident ",null,null,null,null,null,null,null,null,null,null,null,"Moderate","Likely ","High",null,"Rare ","Low","Rare ",null,null,"High","Low ","Medium"]
[null,null,"Highest","Moderate","Unlikely ",4,null,"Heatwave",null,null,null,null,null,null,null,null,null,null,null,"Moderate","Unlikely ","Medium",null,"Rare ","medium","Rare ",null,null,"High","Medium","Medium"]
[null,null,"Highest","Moderate","Rare ",5,null,"Influenza Pandemic",null,null,null,null,null,null,null,null,null,null,null,"Moderate","Rare ","Medium",null,"Rare ","high","Very Rare ",null,null,"High","High","High"]
[null,null,"Highest","Moderate","Very Rare ",5,null,"Infrastructure Failure - building collapse",null,null,null,null,null,null,null,null,null,null,null,"Moderate","Very Rare ","Low",null,"Very Rare ","very low","Very Rare "]
[null,null,"Highest","Moderate","Extremely Rare",5,null,"Infrastructure Failure - roads and bridges collapse",null,null,null,null,null,null,null,null,null,null,null,"Moderate","Extremely Rare","Low",null,"Very Rare ","Low","Very Rare "]
[null,null,"Highest","Major","Almost Certain ",2,null,"Intentional Violence",null,null,null,null,null,null,null,null,null,null,null,"Major","Almost Certain ","Extreme",null,"Very Rare ","medium","Very Rare "]
[null,null,"Highest","Major","Likely ",2,null,"Landslip, Landslide",null,null,null,null,null,null,null,null,null,null,null,"Major","Likely ","Extreme",null,"Very Rare ","high","Very Rare "]
[null,null,"Highest","Major","Unlikely ",3,null,"Marine Pollution",null,null,null,null,null,null,null,null,null,null,null,"Major","Unlikely ","High",null,"Extremely Rare","very low","Extremely Rare"]
[null,null,"Highest","Major","Rare ",3,null,"Nuclear Powered Warships Visits",null,null,null,null,null,null,null,null,null,null,null,"Major","Rare ","High",null,"Extremely Rare","Low","Extremely Rare"]
[null,null,"Highest","Major","Very Rare ",4,null,"Public Health Emergency",null,null,null,null,null,null,null,null,null,null,null,"Major","Very Rare ","Medium",null,"Extremely Rare","medium","Extremely Rare"]
[null,null,"Highest","Major","Extremely Rare",4,null,"Space Debris",null,null,null,null,null,null,null,null,null,null,null,"Major","Extremely Rare","Medium",null,"Extremely Rare","high","Extremely Rare"]
[null,null,"Highest","Catastrophic","Almost Certain ",1,null,"Storm, High Wind, Tempest",null,null,null,null,null,null,null,null,null,null,null,"Catastrophic","Almost Certain ","Extreme"]
[null,null,"Highest","Catastrophic","Likely ",2,null,"Transport Crash - aviation",null,null,null,null,null,null,null,null,null,null,null,"Catastrophic","Likely ","Extreme"]
[null,null,"Highest","Catastrophic","Unlikely ",2,null,"Transport Crash - marine",null,null,null,null,null,null,null,null,null,null,null,"Catastrophic","Unlikely ","Extreme"]
{"$rows_left_out":124}
{"sheet":"Consequence  table","index":4,"n_rows":26,"n_cols":6,"rows_kept":26,"cut":false,"hidden":false,"merged":[[1,0,1,5],[3,0,3,5],[19,0,19,5],[20,0,22,0],[11,0,11,5],[16,0,16,5],[7,0,7,5]]}
[]
["CONSEQUENCE TABLE"]
[null,"INSIGNIFICANT","MINOR","MODERATE","MAJOR","CATASTROPHIC"]
["PEOPLE"]
["Mortality","•  Not Applicable","•  Deaths greater than 1 in 10,000,000 people for the population of interest","•  Deaths greater than 1 in 1,000,000 people for the population of interest","•  Deaths greater than 1 in 100,000 people for the population of interest","•  Deaths greater than 1 in 10,000 people for the population of interest."]
[null,null,"•  0.05 persons","•  >0.5 persons","•  >5 persons","•  >50 persons"]
["Injuries/Illness","•  Less than 1 in 1,000,000 people of the population serious injured or any minor injuries","•  Greater than 1 in 10,000,000 people of the population critically injured with long-term or permanent incapacitation or 1 in 1,000,000 people of the population seriously injured","•  Greater than 1 in 1,000,000 people of the population critically injured with long-term or permanent incapacitation or 1 in 100,000 people of the population seriously injured","•  Greater than 1 in 100,000 people of the population critically injured with long-term or permanent incapacitation or 1 in 10,000 people of the population seriously injure","•  Greater than 1 in 10,000 people of the population critically injured with long-term or permanent incapacitation"]
["ECONOMY"]
["Loss in economic activity and/or asset value","•  Decline of economic activity and/or loss of asset value <0.004% of gross area product","•  Decline of economic activity and/or loss of asset value  >0.004% of gross area product","•  Decline of economic activity and/ or loss of asset value >0.04% of gross area product","•  Decline of economic activity and/or loss of asset value   >0.4% of gross area product","•  Decline of economic activity and/or loss of asset value >4% of gross area product"]
[null,"~$100 000"," ~$1 000 000","•  ~$10 000 000","~$100 000 000","•  ~$ 1 000 000 000"]
["Impact on important industry","•  Inconsequential business sector disruption","•  Significant industry or business sector is impacted by the emergency event, resulting in short-term (i.e. less than one year) profit reductions","•  Significant industry or business sector is significantly impacted by the emergency event, resulting in medium-term (i.e. more than one year) profit reductions","•  Significant structural adjustment required by a significant industry to respond and recover from emergency event","•  Failure of a significant industry or sector"]
["ENVIRONMENT"]
["Loss of species and/ or landscapes","•  Minor damage of local or regional level significant and recognized ecosystem or species.","•  Significant loss/impairment of state level significant and recognized ecosystem or species.","•  Significant loss/impairment of nationally-significant and recognized ecosystem or species.","•  Severe damage or loss of nationally-significant and recognized ecosystem or species.","•  Permanent destruction of nationally-significant and recognized ecosystem or species."]
[null,null,"•  Minor damage of regional level significant and recognized ecosystem or species.","•  Severe damage of state level significant and recognized ecosystem or species.","•  Permanent destruction of state level significant and recognized ecosystem or species."]
[null,null,null,"•  Permanent destruction of regional level significant and recognized ecosystem or species."]
["Loss of environmental value","•  Inconsequential damage to environmental values of interest","•  Minor damage to environmental values of interest","•  Significant damage to environmental values of interest","•  Severe damage to environmental values of interest","•  Permanent destruction of environmental values of interest"]
["PUBLIC ADMINISTRATION"]
["Governance Functions","•  Governing bodies’ and institutions delivery of core functions is unaffected or within normal parameters","•  Governing bodies and institutions encounter limited reduction in delivery of core functions","•  Governing bodies  and institutions encounter significant reduction in the delivery of core functions","•  Governing bodies and institutions encounter severe reduction in the delivery of core functions","•  Governing bodies and institutions are unable to deliver their core functions"]
[null,null,null,"•  governing bodies and institutions are required to divert some available resources to deliver core functions or seek external assistance to deliver some of their core functions","•  Governing bodies and institutions are required to divert  a significant amount of available resources to deliver core functions or seek external assistance to deliver the majority of their core functions"]
["SOCIAL SETTING"]
["Community wellbeing","•  Community social fabric is disrupted","•  Community social fabric is damaged","•  Community social fabric is broken","•  Community social fabric is significantly broken","•  Community social fabric is irreparably broken"]
[null,"•  Existing resources sufficient to return the community to normal function","•  Some external resources required to return the community to normal function","•  Significant external resources required to return the community to normal function","•  Extraordinary external resources required to return the community to functioning effectively","•  Community ceases to function effectively, breaks down"]
[null,"•  No permanent dispersal","•  No permanent dispersal","•  No permanent dispersal","•  Significant permanent dispersal","•  Community disperses in its entirety"]
["Community services","•  Inconsequential / short term reduction","•  Isolated/ temporary reductions","•  Ongoing reductions","•  Reduced quality of life","•  Community unable to support itself"]
["Culturally important objects","•  Minor damage to objects of identified cultural significance","•  Damage to objects of identified cultural significance","•  Widespread damage to objects of identified cultural significance","•  Widespread damage or localised permanent loss of objects of identified cultural significance","•  Widespread permanent loss of objects of identified cultural significance"]
["Culturally important activities","•  Minor delay of a major culturally important activity or event","•  Delay of a major culturally important activity or event ","•  Some delay or reduced scope to a major culturally important activity or event","•  Temporary cancellation or significant delay to a major culturally important community activity or event","•  Permanent cancellation of a major culturally important community activity or event"]

{"sheet":"likelihood table","index":5,"n_rows":8,"n_cols":5,"rows_kept":8,"cut":false,"hidden":false,"merged":[]}
[]
[null,"LIKELIHOOD LEVEL","ANNUAL EXCEEDANCE PROBABILITY IN % (AEP)","AVERAGE RECURRENCE INTERVAL (ARI) (INDICATIVE)","FREQUENCY (INDICATIVE)"]
[null,"Almost Certain","63% per year or more","1 year or less","Once or more per year"]
[null,"Likely","10 - <63% per year","1-10 years","Once per 10 years"]
[null,"Unlikely","1 - <10% per year","11-100 years","Once per 100 years"]
[null,"Rare","0.1 - <1% per year","101-1000 years","Once per 1000 years"]
[null,"Very Rare","0.01 - <0.1% per year","1001-10,000 years","Once per 10,000 years"]
[null,"Extremely rare","<0.01% per year","10,001 years or more","Once per 100,000 years"]

{"sheet":"controls and risk matrix","index":6,"n_rows":40,"n_cols":14,"rows_kept":40,"cut":false,"hidden":false,"merged":[[0,1,0,5],[16,1,16,5],[24,8,24,9],[18,8,18,9],[17,7,17,13],[16,7,16,13],[1,2,1,5],[19,8,19,9],[20,8,20,9],[21,8,21,9],[22,8,22,9],[23,8,23,9],[17,1,17,5],[30,3,30,5],[29,3,29,5],[31,3,31,5],[32,3,32,5],[33,3,33,5],[39,3,39,5],[34,3,34,5],[35,3,35,5],[36,3,36,5],[37,3,37,5],[38,3,38,5]]}
[null,"Control effectiveness"]
[null,null,"CONTROL EXPEDIENCY "]
[null,"CONTROL STRENGTH","VERY LOW","LOW","MEDIUM","HIGH"]
[null,"High","LOW","MEDIUM","MEDIUM","HIGH"]
[null,"Medium","LOW","MEDIUM","MEDIUM","MEDIUM"]
[null,"Low","VERY LOW","LOW","MEDIUM","MEDIUM"]
[null,"Very low","VERY LOW","VERY LOW","LOW","LOW"]
[]
[]
[]
[]
[]
[]
[]
[]
[]
[null,"Liklihood after controls",null,null,null,null,null,"risk matrix"]
[null,"CONTROL EFFECTIVENESS",null,null,null,null,null,"CONSEQUENCE LEVEL"]
[null,"Event likelihood","VERY LOW","LOW","MEDIUM","HIGH",null,"LIKELIHOOD","INSIGNIFICANT",null,"MINOR","MODERATE","MAJOR","CATASTROPHIC"]
[null,"Almost Certain","ALMOST CERTAIN","ALMOST CERTAIN","LIKELY","LIKELY",null,"Almost Certain","MEDIUM",null,"MEDIUM","HIGH","EXTREME","EXTREME"]
[null,"Likely","LIKELY","LIKELY","UNLIKELY","UNLIKELY",null,"Likely","LOW",null,"MEDIUM","HIGH","EXTREME","EXTREME"]
[null,"Unlikely","UNLIKELY","UNLIKELY","UNLIKELY","RARE",null,"Unlikely","LOW",null,"LOW","MEDIUM","HIGH","EXTREME"]
[null,"Rare","RARE","RARE","RARE","VERY RARE",null,"Rare","VERY LOW",null,"LOW","MEDIUM","HIGH","HIGH"]
[null,"Very Rare","VERY RARE","VERY RARE","VERY RARE","VERY RARE",null,"Very Rare","VERY LOW",null,"VERY LOW","LOW","MEDIUM","HIGH"]
[null,"Extremely rare","EXTREMELY RARE","EXTREMELY RARE","EXTREMELY RARE","EXTREMELY RARE",null,"Extremely rare","VERY LOW",null,"VERY LOW","LOW","MEDIUM","HIGH"]
[]
[]
[]
[]
[null,"LEVEL","CONTROL STRENGTH","CONTROL EXPEDIENCY"]
{"$rows_left_out":11}
{"sheet":"confidence table","index":7,"n_rows":14,"n_cols":7,"rows_kept":14,"cut":false,"hidden":false,"merged":[[8,1,11,1],[8,2,11,2],[0,1,0,6],[4,1,7,1],[4,2,7,2],[1,1,1,6],[12,1,13,1],[12,2,13,2],[12,3,13,3],[12,5,13,5],[12,6,13,6]]}
[null,"confidence table"]
[null,"CONFIDENCE LEVEL"]
[null,null,"LOWEST","LOW","MODERATE","HIGH","HIGHEST"]
[null,"Confidence descriptor","Assessed consequence/ likelihood could be one of four or more levels, with fundamental uncertainty","Assessed consequence/ likelihood risk could be one of three or more levels, with major uncertainty","Assessed consequence/ likelihood could be one of two levels, with significant uncertainty","Assessed consequence/ likelihood has only one level, but with some uncertainty in the assessment","Assessed consequence/ likelihood is easily assessed to one level, with almost no uncertainty"]
[null,"Supporting evidence","No historical events or quantitative modelled results to support the levels","Some comparable historical events through anecdotal information","Historical event of similar magnitude to that being assessed in a comparable community of interest","Recent historical event of similar magnitude to that being assessed in a directly comparable community of interest","Recent historical event of similar magnitude to that being assessed in the community of interest"]
[null,null,null,"or","or","or","or"]
[null,null,null,"Quantitative modelling and analysis with extensive extrapolation of data required to derive results of relevance to the event being assessed","Quantitative modelling and analysis with reasonable extrapolation of data required to derive results of direct relevance to the event being assessed","Quantitative modelling and analysis uses sufficient quality and length of data to derive results of direct relevance  to the event being assessed","Quantitative modelling and analysis of highest quality and length of data relating directly to the affected community, used to derive results of direct relevance to the scenario being assessed"]
[]
[null,"Expertise","No relevant technical expertise is available to the team for analysis","Risk assessment team contains technical expertise related to the field being assessed","Risk assessment team contains relevant technical expertise in the field being assessed, and experience in data and/or modelling of relevance to the event being assessed","Risk assessment team contains relevant technical expertise in the field being assessed, and experience  with data and/or modelling relating to the event being assessed","Risk assessment team contains relevant and demonstrated technical expertise in the field being assessed, and experience in data and/or modelling of direct relevance to the scenario being assessed"]
[null,null,null,"and","and","and","and"]
[null,null,null,"Technical expertise is taken into account by the risk assessment team","Technical expertise is used by the risk assessment team","Technical expertise is highly influential in the decisions of the risk assessment team","Technical expertise is highly influential in the decisions of the risk assessment team"]
[]
[null,"Participant agreement","Fundamental disagreement on level of consequence, with little prospect of agreement","Disagreements on fundamental issues relating to the assessment of consequence, which would lead to a range of rating levels","Disagreement on significant issues, which would lead to different levels of consequence","Disagreement on only minor aspects, which have little effect on the assessment of level of consequence","Agreement among participants on the assessment of levels of consequence"]
[null,null,null,null,"depending on which argument was followed"]